Carimbodedatahora,VoceconcordacomostermosexpostosnoTCLEacima,VoceentregouumaviadoTCLEaopacienteemanteveumaviaassi_A,VoceentregouumaviadoTCLEaopacienteemanteveumaviaassi,OpacienteemquestaoeSUSPEITOouCONFIRMADOparaCOVID19,IdentificacaodopacientePreenchaestecampocomasIniciaisd,RGCT,CidadeeEstadoAtual,Regiaodopais,IniciaisdoPaciente,Sexodoreceptor,Datadenascimentodoreceptor,idadereceptor,≥60,Etniadoreceptor,PesodoReceptornomomentodotransplantekg,Alturadoreceptornomomentodotransplantecm,IMCdoreceptornomomentodotransplante,Motivoparaotransplantehepaticomarquetodasqueseenquadra,Datadotransplante,Tempo_Desde_TX,LocaldoTransplanteHospitalEquipe,Orgaotransplantadosimultaneamenteouaposofigadomarquetod,AntecedentesPessoaisdoReceptormarquetodosospresentes,Usodemedicacoesantihipertensivas,Tabagismoatualouprevio,Cardiopatia,Diabetes,Dislipidemia,Doenca_Autoimune,DRC,Hipertensao,Hipotireoidismo,Neoplasia_atual_ou_pregressa,Obesidade,Pneumopatia_previa,Transplante_renal_previo,SintomassugestivosdeCOVIDmarquetodosospresentes,Nauseas_vomito,Odinofagia,Sinais_neurologicos,Tosse,Artralgia,Dor_abdominal,Espirros,Espectoracao,Hipoxemia,Adinamia,Outros,Fadiga,Alt_olfato,Febre,Mialgia,Alt_paladar,Anorexia,Assintomatico,Calafrios,Cefaleia,Congestao_nasal,Coriza,Diarreia,Dispneia,Dor_toracica,SinaisesintomasdeCOVID19quesurgiramnaevolucaodadoenca,Datadoiniciodossintomas,Dataemqueopacientebuscouservicosdesaude,Tempo_busca_SV_Saude,Tempo_para_testagem_COVID,Tempo_entre_sintomas_e_internacao,DatadarealizacaodotesteconfirmatorioCOVID19,Onda_COVID,Datadainternacao,KAPLANMEIER_T_Sintoma_ate_obito,KAPLANMEIER_T_Diag_ate_obito,TestesrealizadosparaCOVID,Tratamento,UTI,NumerodediasemUTICTIsenaohouveinternacaoemUTImar,Numerodediasemintubacaoorotraquealsenaohouveintubacao,Tempoentreiniciodossintomasecomecodotratamentodias,TempodetratamentocomterapiasespecificasparaCOVID19dias,DesfechoPrincipaldopaciente,DatadoObitosepacientevivonaopreencher,Tempo_de_seguimento_dias,Necessidadedeventilacaomecanicanainternacao,Datadaintubacaoorotraquealsenaohouveintubacaonaopreen,Necessidadedehemodialiseainternacao,Regimedeimunossupressao,AZA,CsA,EVR,PRED,SIROLIMUS,TAC,MFS,MMF,ComoforamconduzidososimunossupressoresduranteadoencaMa,Com_vs_sem_alt_imunossupressao,ForaminstituidostratamentosespecificosparaCOVID19,Com_vs_sem_tratamento,UsodeterapiacomcorticoesteroidesaodiagnosticodeCOVID19,Com_vs_sem_CTC_previo,Perdadoenxertonos3mesesaposresolucaodainfeccao,Casotenhaocorridoperdadoenxertomarqueadatadaperda,Opacienteapresentasequelaspulmonares3mesesaposresolucao,Opacientefoiaobitonos3mesesaposaresolucaodainfeccao,DIVISOR_INTERNACAO,AnormalidadesvisualizadasemRaioXdetorax,Anormalidadesdetectadasnatomografia,HemogramaContagemdelinfocitostotaiseporcentagem,HemogramaHemoglobinaaadmissaogdL,HemogramaContagemPlaquetasaadmissaocelsÂµL,DosagemdeProteinaCreativaPCRaadmissao,DosagemdeTGOASTaadmissao,DosagemdeTGPALTaadmissao,Dosagemdebilirrubinaaadmissao,DosagemdeFosfataseAlcalinaFALCaadmissao,DosagemdeGamaGTGGTaadmissao,Dosagemdealbuminaaadmissao,DosagemdeRNIINRaadmissao,ValordeCreatininabasalmediadosultimos3valoresdecreati,ValordeSodiosericoaadmissao,ValordeTroponinaaadmissao,ValordeDdimeroaadmissao,Coinfeccao_Admissao,NiveldeimunosupressaongmLCyaFKEVRMMF,Presencadeasciteaadmissao,Presencadeencefalopatiaaadmissao,DIVISIOR___DOADOR,IdadedoDoador,SexodoDoador,DatadaMorteEncefalicadoDoador,Pesododoadorkg,Alturadodoadorcentimetros,TempodeUTIdodoadordias,DoadorfoiinternadoemquetipodeUTI,CausadaMorteEncefalicadoDoador,Usodedrogasvasoativaspelodoador,Sinaisdedoencainfecciosanodoador,Sinaisdeinfeccaorespiratorianodoador,Tomografiadetoraxdodoador,SaturacaoO2doador,DoadorcoletouSorologiaCOVID19,DoadorcoletouPCRSwabNasalparaCOVID19,QualdosexamescolhidosforneceuresultadopositivoparaCOVID,TGOASTdoador,TGPALTDoador,BilirrubinaDoadormgdL,FosfataseAlcalinadodoadorFALC,GamaglutamiltransferasedodoadorGGT,AlbuminadodoadorgdL,RNIINRdoador,DIVISOR___ALTA,Datadaaltahospitalarcasotenhaocorrido,PacienterealizoutestecomSwabnasalparacontroledecurae,CasopacientetenharealizadoSwabparacontroledecurainseri,NumerodeSwabsdecurarealizados,PacienterealizousorologiaELISAparacontroledecura,Creatininasericadaalta,Creatininaserica3mesesaposaalta,Pacienteapresentaascite3mesesaposainfeccao,Pacienteapresentaencefalopatia3mesesaposainfeccao,ValordeTGOAST3mesesaposresolucaodainfeccao,ValordeTGPALT3mesesaposresolucaodainfeccao,ValordeBilirrubina3mesesaposresolucaodainfeccao,ValordeFosfataseAlcalinaFALC3mesesaposresolucaodainf,ValordeGamaGTGGT3mesesaposresolucaodainfeccao
2021-06-23,Sim,,Sim,Confirmado,A.D-2-ICDF,787675320,RIO BRANCO - AC,Centro-Oeste / DF,A.D,Feminino,1951-09-16,69.0,1.0,Branco,77.0,164.0,28.63,Colangite Esclerosante Primaria,2013-07-07,8.0,ICDF,Nao houve transplantes junto ou apos o figado,"Hipertensao, Diabetes Mellitus Tipo 1 ou Tipo 2","Inibidores da ECA (Captopril, enalapril, ramipril)",Sem informacao,0.0,1.0,0.0,0.0,0.0,1.0,0.0,0.0,0.0,0.0,0.0,,0.0,0.0,0.0,0.0,0.0,0.0,0.0,0.0,0.0,0.0,0.0,0.0,0.0,0.0,0.0,0.0,0.0,0.0,0.0,0.0,0.0,0.0,0.0,0.0,0.0,,,,0.0,,,,,,,,,Hospitalar / Internacao,,0.0,,,0.0,1.0,,,Sim - sem pronacao,,Sim,FK + MMS + PRED,0.0,0.0,0.0,1.0,0.0,1.0,1.0,0.0,,,,0.0,Sem informacao,,,,,,,Nao realizou radiografia de torax / Nao informado,Nao realizou Tomografia de torax / Nao informado,,,,,,,,,,,,,,,,Sem infromacoes,,Nao informado,Nao informado,,,,,,,,,,,,,Nao realizada,,Nao,Nao,,,,,,,,,,,,,,,,,,,,,,,
2021-03-31,Sim,,Sim,Confirmado,HUWC/HSC- 17- LSC,159152-2320,"Fortaleza, CE",Nordeste,LSC,Feminino,1960-08-15,61.0,1.0,Pardo,88.0,156.0,36.16,Criptogenica,2016-07-09,5.0,Hospital Sao Carlos - HSC,Nao houve transplantes junto ou apos o figado,"Obesidade, Asma, DRC",Nao usava,Nao,0.0,0.0,0.0,0.0,1.0,0.0,0.0,0.0,1.0,1.0,0.0,Dispneia/ Dor toracica,0.0,0.0,0.0,0.0,0.0,0.0,0.0,0.0,0.0,0.0,0.0,0.0,0.0,0.0,0.0,0.0,0.0,0.0,0.0,0.0,0.0,0.0,0.0,1.0,1.0,"Dispneia, Dor toracica",2021-03-16,2021-03-17,1.0,1.0,0.0,2021-03-17,2.0,2021-03-17,3.0,2.0,PCR-Swab Nasal,Hospitalar / Internacao,,0.0,2.0,,0.0,2.0,2021-03-19,2.0,Sim - com pronacao,2021-03-18,Sim,TAC-MFS,0.0,0.0,0.0,0.0,0.0,1.0,1.0,0.0,Doses mantidas,0.0,Amoxicilina + Clavulanato,1.0,Sem informacao,,Nao,,,,,Nao realizou radiografia de torax / Nao informado,Nao realizou Tomografia de torax / Nao informado,,,,,,,,,,,,,,,,Sim,,Nao,Nao,,38.0,Masculino,2016-07-08,75.0,160.0,,UTI geral,TCE,Sim,Não,Nao,Nao realizada,,Nao,Nao,,356.0,244.0,,33.0,25.0,,,,,Nao,,,Nao,,,,,,,,,
2020-12-10,Sim,,Sim,Confirmado,SCMBH-3-MAC,215257-3121,"Belo Horizonte, MG",Sudeste,MAC,Feminino,1950-08-27,70.0,1.0,Negro,81.0,158.0,32.45,"Hepatite / Cirrose Alcoolica, Carcinoma Hepatocelular  (CHC)",2018-11-18,2.0,Santa Casa de Belo Horizonte,Nao houve transplantes junto ou apos o figado,"Hipertensao, Diabetes Mellitus Tipo 1 ou Tipo 2, Obesidade, DRC",Nao usava,Nao,0.0,1.0,0.0,0.0,1.0,1.0,0.0,0.0,1.0,0.0,0.0,Febre/ Cefaleia/ Mialgia/ Diarreia/ Alteracao do olfato,0.0,0.0,0.0,0.0,0.0,0.0,0.0,0.0,0.0,0.0,0.0,0.0,1.0,1.0,1.0,0.0,0.0,0.0,0.0,1.0,0.0,0.0,1.0,0.0,0.0,"Febre, Cefaleia, Mialgia, Diarreia, Alteracao do olfato",2020-12-05,2020-12-08,3.0,3.0,0.0,2020-12-08,2.0,2020-12-08,285.0,282.0,PCR-Swab Nasal,Hospitalar / Internacao,,0.0,,,0.0,1.0,,2.0,Nao,,Nao,TAC-EVR,0.0,0.0,1.0,0.0,0.0,1.0,0.0,0.0,"Reducao de inibidores de Calcineurina (TAC, CsA)",1.0,,0.0,Nao,0.0,,,,,,Consolidacao focal / unilateral,Nao realizou Tomografia de torax / Nao informado,855-27,,64000.0,66.0,30.0,17.0,,95.0,45.0,,,,134.0,,,Sim,,Nao,Nao,,55.0,Feminino,2018-11-17,,,,UTI geral,,,,,Nao realizada,,Nao,Nao,,,,,,,,,,,Nao,,,Nao,,,,,,,,,
2021-06-23,Sim,,Sim,Confirmado,CF-04-ICDF,2619545320,"BRASILIA, DF",Centro-Oeste / DF,CF,Feminino,1961-12-21,59.0,0.0,Negro,,,,Auto-imune,2020-11-20,0.0,ICDF,Nao houve transplantes junto ou apos o figado,,Sem dados,Sem informacao,0.0,0.0,0.0,0.0,0.0,0.0,0.0,0.0,0.0,0.0,0.0,,0.0,0.0,0.0,0.0,0.0,0.0,0.0,0.0,0.0,0.0,0.0,0.0,0.0,0.0,0.0,0.0,0.0,0.0,0.0,0.0,0.0,0.0,0.0,0.0,0.0,,2020-11-27,2020-11-27,0.0,,,,,,4.0,,,Hospitalar / Internacao,"    1,00",5.0,5.0,1.0,5.0,2.0,2020-12-01,4.0,Sim - sem pronacao,2020-11-27,Sim,PRED,0.0,0.0,0.0,1.0,0.0,0.0,0.0,0.0,Suspensao total,1.0,Cortico-esteroides em altas doses,1.0,Sem informacao,,,,,Nao,,Nao realizou radiografia de torax / Nao informado,Nao realizou Tomografia de torax / Nao informado,,8.0,34.0,,72.0,156.0,38.0,978.0,285.0,,,,146.0,,,Sem infromacoes,,Nao informado,Nao informado,,45.0,Feminino,2020-11-26,70.0,,,,AVC (hemorragico ou isquemico),,,,Nao realizada,,Nao,Nao,,,,,,,,,,,Nao,,,,,,Nao,Nao,,,,,
2021-04-30,Sim,,Sim,Confirmado,HSC-31-MSP,173315-2320,"Fortaleza, CE",Nordeste,MSP,Feminino,1957-11-10,63.0,1.0,Pardo,,,,Carcinoma Hepatocelular  (CHC),2019-03-07,2.0,Hospital Sao Carlos - HSC,Nao houve transplantes junto ou apos o figado,Diabetes Mellitus Tipo 1 ou Tipo 2,Sem dados,Nao,0.0,1.0,0.0,0.0,0.0,0.0,0.0,0.0,0.0,0.0,0.0,Tosse/ Espirros/ Cefaleia/ Congestao nasal/ Fadiga/ Alteracao do olfato,0.0,0.0,0.0,1.0,0.0,0.0,1.0,0.0,0.0,0.0,0.0,1.0,1.0,0.0,0.0,0.0,0.0,0.0,0.0,1.0,1.0,0.0,0.0,0.0,0.0,"Tosse, Dispneia, Espirros, Cefaleia, Congestao nasal, Fadiga, Alteracao do olfato",2021-04-21,2021-04-26,5.0,66.0,,2021-06-26,2.0,,148.0,82.0,Sorologia,Domiciliar,,0.0,,,0.0,1.0,,4.0,Paciente nao foi internado,,Paciente nao foi internado,TAC-MFS,0.0,0.0,0.0,0.0,0.0,1.0,1.0,0.0,Suspensao MMF,1.0,,0.0,Nao,0.0,,,,,,Nao realizou radiografia de torax / Nao informado,Nao realizou Tomografia de torax / Nao informado,,,,,,,,,,,,,,,,Nao,,Nao,Nao,,20.0,Masculino,2019-03-06,70.0,165.0,3.0,UTI geral,TCE,Sim,Não,Nao,Nao realizada,,Nao,Nao,,98.0,238.0,,240.0,35.0,,,,,Nao,,,Nao,,,,,,,,,
2021-05-25,Sim,,Sim,Confirmado,HC UNICAMP - 19 - EMJ,214437-6,"HORTOLANDIA, SP",Sudeste,EMJ,Feminino,1949-08-28,71.0,1.0,Branco,96.0,160.0,37.5,Carcinoma Hepatocelular  (CHC),2017-04-13,4.0,HC - UNICAMP,Nao houve transplantes junto ou apos o figado,"Hipertensao, Diabetes Mellitus Tipo 1 ou Tipo 2, Obesidade",Nao usava,Sem informacao,0.0,1.0,0.0,0.0,0.0,1.0,0.0,0.0,1.0,0.0,0.0,Febre/ Mialgia,0.0,0.0,0.0,0.0,0.0,0.0,0.0,0.0,0.0,0.0,0.0,0.0,0.0,1.0,1.0,0.0,0.0,0.0,0.0,0.0,0.0,0.0,0.0,0.0,0.0,"Febre, Mialgia",2021-05-11,2021-05-18,7.0,8.0,-1.0,2021-05-19,2.0,2021-05-18,128.0,120.0,PCR-Swab Nasal,Hospitalar / Internacao,,0.0,,0.0,0.0,1.0,,7.0,Nao,,Nao,CsA-MFS,0.0,1.0,0.0,0.0,0.0,0.0,1.0,0.0,Suspensao total,1.0,,0.0,Sim,1.0,,,,,,Nao realizou radiografia de torax / Nao informado,Opacidades em vidro fosco,1320 - 17,,215000.0,,23.0,29.0,,86.0,105.0,4.0,,,135.0,,,Nao,,Nao,Nao,,50.0,Feminino,2017-04-13,80.0,165.0,3.0,UTI geral,AVC (hemorragico ou isquemico),Sim,Sim,Nao,Nao realizada,100.0,Nao,Nao,,23.0,14.0,,49.0,11.0,,,,2021-05-24,Nao,,,Nao,,,,,,,,,
2021-07-01,Sim,,Sim,Confirmado,SCSJC-MJNO,266383-6,"Sao Jose dos Campos, SP",Sudeste,MJNO,Feminino,1953-05-20,68.0,1.0,Pardo,55.0,152.0,23.81,Criptogenica,2020-08-13,1.0,Santa Casa de Sao Jose dos Campos,Nao houve transplantes junto ou apos o figado,,Nao usava,Nao,0.0,0.0,0.0,0.0,0.0,0.0,0.0,0.0,0.0,0.0,0.0,Dispneia,0.0,0.0,0.0,0.0,0.0,0.0,0.0,0.0,0.0,0.0,0.0,0.0,0.0,0.0,0.0,0.0,0.0,0.0,0.0,0.0,0.0,0.0,0.0,1.0,0.0,"Febre, Dispneia",2021-02-01,2021-02-02,1.0,2.0,-1.0,2021-02-03,2.0,2021-02-02,15.0,13.0,PCR-Swab Nasal,Hospitalar / Internacao,"    1,00",14.0,14.0,,0.0,2.0,2021-02-16,14.0,Sim - sem pronacao,2021-02-02,Nao,TAC-MFS,0.0,0.0,0.0,0.0,0.0,1.0,1.0,0.0,Suspensao MMF,1.0,Cortico-esteroides em altas doses,1.0,Sim,1.0,,,,,,Nao realizou radiografia de torax / Nao informado,Opacidades em vidro fosco,,,,,,,,,,,,,,,,Nao,,Nao,Nao,,52.0,Feminino,2020-08-12,68.0,160.0,10.0,UTI geral,AVC (hemorragico ou isquemico),Sim,Não,Nao,Nao realizada,,Sim,Sim,,29.0,43.0,216.0,176.0,804.0,,,,,Nao,,,Nao,,,,,,,,,
2021-04-23,Sim,,Sim,Confirmado,HSC-25-TKCS,182649-2320,"Fortaleza, CE",Nordeste,TKCS,Feminino,1995-05-16,26.0,0.0,Pardo,71.0,153.0,30.33,Auto-imune,2017-07-09,4.0,Hospital Sao Carlos - HSC,Nao houve transplantes junto ou apos o figado,"Obesidade, DRGE",Nao usava,Nao,0.0,0.0,0.0,0.0,0.0,0.0,0.0,0.0,1.0,0.0,0.0,Alteracao do olfato/ Alteracao do paladar,0.0,0.0,0.0,0.0,0.0,0.0,0.0,0.0,0.0,0.0,0.0,0.0,1.0,0.0,0.0,1.0,0.0,0.0,0.0,0.0,0.0,0.0,0.0,0.0,0.0,"Cefaleia, Alteracao do olfato, Alteracao do paladar",2021-03-29,2021-04-08,10.0,10.0,,2021-04-08,2.0,,171.0,161.0,PCR-Swab Nasal,Domiciliar,,0.0,,,0.0,1.0,,15.0,Paciente nao foi internado,,,TAC-MMF + PRED,0.0,0.0,0.0,1.0,0.0,1.0,0.0,1.0,Doses mantidas,0.0,,0.0,Sim,1.0,,,,,,Nao realizou radiografia de torax / Nao informado,Nao realizou Tomografia de torax / Nao informado,,,,,,,,,,,,,,,,Nao,,Nao,Nao,,54.0,Feminino,2017-07-09,56.0,155.0,11.0,UTI geral,AVC (hemorragico ou isquemico),Sim,Sim,Sim,Nao realizada,,Nao,Nao,,93.0,86.0,,592.0,201.0,,,,,,,,,,,,,,,,,
2020-12-29,Sim,,Sim,Confirmado,"HSC,3 EAPSL",267852-6,"Sao Jose dos Campos, SP",Sudeste,EAPSL,Feminino,1979-06-06,42.0,0.0,Branco,58.0,174.0,19.16,Perda de Enxerto,2020-06-18,1.0,Hospital Santa Casa de Sao Jose dos Campos,Nao houve transplantes junto ou apos o figado,Doenca auto-imune,Nao usava,Nao,0.0,0.0,0.0,1.0,0.0,0.0,0.0,0.0,0.0,0.0,0.0,Dispneia,0.0,0.0,0.0,0.0,0.0,0.0,0.0,0.0,0.0,0.0,0.0,0.0,0.0,0.0,0.0,0.0,0.0,0.0,0.0,0.0,0.0,0.0,0.0,1.0,0.0,Dispneia,2020-07-04,2020-06-18,-16.0,0.0,-16.0,2020-07-04,1.0,2020-06-18,1.0,1.0,PCR-Swab Nasal,Hospitalar / Internacao,"    1,00",17.0,2.0,2.0,2.0,2.0,2020-07-05,17.0,Sim - sem pronacao,2020-07-04,Sim,TAC-MFS,0.0,0.0,0.0,0.0,0.0,1.0,1.0,0.0,Suspensao MMF,1.0,Cortico-esteroides em altas doses,1.0,Sim,1.0,,,,,,Radiografia normal,Opacidades em vidro fosco,26.1,,,,32.0,26.0,,102.0,111.0,,,,,,,Nao,,Sim,Nao,,38.0,Feminino,2020-06-17,80.0,175.0,3.0,UTI geral,AVC (hemorragico ou isquemico),Sim,Não,Nao,Normal,,Nao,Sim,PCR,27.0,21.0,,77.0,54.0,,,,,Nao,,,Nao,,,,,,,,,
2021-08-02,Sim,,Sim,Confirmado,HLL-04-AADSB,132007-5,"Sao Paulo, SP",Sudeste,AADSB,Feminino,1956-04-27,65.0,1.0,Branco,65.0,,,Hepatite C,2011-01-17,10.0,H Leforte,Nao houve transplantes junto ou apos o figado,"Hipertensao, Diabetes Mellitus Tipo 1 ou Tipo 2, IRC","Bloqueadores do receptor AT2 (Losartan, Valsartan)",Nao,0.0,1.0,0.0,0.0,1.0,1.0,0.0,0.0,0.0,0.0,0.0,Dispneia/ Fadiga,0.0,0.0,0.0,0.0,0.0,0.0,0.0,0.0,0.0,0.0,0.0,1.0,0.0,0.0,0.0,0.0,0.0,0.0,0.0,0.0,0.0,0.0,0.0,1.0,0.0,"Tosse, Dispneia, Dor toracica, Fadiga",2021-02-15,2021-02-17,2.0,3.0,-1.0,2021-02-18,2.0,2021-02-17,20.0,17.0,PCR-Swab Nasal,Hospitalar / Internacao,"    1,00",19.0,19.0,2.0,0.0,2.0,2021-03-07,18.0,Sim - com pronacao,2021-02-18,Sim,TAC-MFS,0.0,0.0,0.0,0.0,0.0,1.0,1.0,0.0,Suspensao MMF,1.0,,0.0,Sim,1.0,,,,,,Consolidacoes bilaterais,Nao realizou Tomografia de torax / Nao informado,20510,,116.0,,,,,,,,,,139.0,716.0,,Sim,,Nao,Nao,,,,,,,,,,,,,Nao realizada,,Nao,Nao,,,,,,,,,,,Nao,,,,,,,,,,,,
2021-07-10,Sim,,Sim,Confirmado,HUCFF-10-NLNR,00,"Rio de Janeiro, RJ",Sudeste,NLNR,Feminino,1960-03-06,61.0,1.0,Pardo,51.0,155.0,21.23,Criptogenica,2021-01-14,0.0,HUCFF/UFRJ,Nao houve transplantes junto ou apos o figado,"Diabetes Mellitus Tipo 1 ou Tipo 2, Asma",Nao usava,Nao,0.0,1.0,0.0,0.0,0.0,0.0,0.0,0.0,0.0,1.0,0.0,Febre/ Tosse/ Expectoracao/ Fadiga/ Nauseas / vomitos/ Diarreia,1.0,0.0,0.0,1.0,0.0,0.0,0.0,1.0,0.0,0.0,0.0,1.0,0.0,1.0,0.0,0.0,0.0,0.0,0.0,0.0,0.0,0.0,1.0,0.0,0.0,Dispneia,2021-05-19,2021-05-21,2.0,3.0,6.0,2021-05-22,2.0,2021-05-28,23.0,20.0,Sorologia,Hospitalar / Internacao,"    1,00",12.0,10.0,10.0,14.0,2.0,2021-06-11,21.0,Sim - com pronacao,2021-06-02,Nao,TAC-MFS,0.0,0.0,0.0,0.0,0.0,1.0,1.0,0.0,Suspensao total,1.0,"Cortico-esteroides em altas doses, Heparina",1.0,Sim,1.0,,,,,,Nao realizou radiografia de torax / Nao informado,Opacidades em vidro fosco,1145,,,,28.0,30.0,,323.0,334.0,,,,136.0,0.0,6952.0,Nao,0.0,Nao,Nao,,0.0,,,,,,,,,,,Nao realizada,,Nao,Sim,,,,,,,,,,,Nao,,,Nao,0.0,0.0,,,,,,,
2021-07-08,Sim,,Sim,Confirmado,HC UNICAMP - TSS,157918-6,"CAMPINAS, SP",Sudeste,TSS,Feminino,1946-08-02,75.0,1.0,Asiatico,50.0,155.0,20.81,Criptogenica,2013-04-05,8.0,HC - UNICAMP,Nao houve transplantes junto ou apos o figado,"Hipertensao, Diabetes Mellitus Tipo 1 ou Tipo 2, DRC",Sem dados,Sem informacao,0.0,1.0,0.0,0.0,1.0,1.0,0.0,0.0,0.0,0.0,0.0,Febre/ Tosse/ Mialgia,0.0,0.0,0.0,1.0,0.0,0.0,0.0,0.0,0.0,0.0,0.0,0.0,0.0,1.0,1.0,0.0,0.0,0.0,0.0,0.0,0.0,0.0,0.0,0.0,0.0,"Febre, Tosse, Mialgia",2021-06-11,2021-06-16,5.0,0.0,,2021-06-11,2.0,,97.0,97.0,PCR-Swab Nasal,Domiciliar,,0.0,,,0.0,1.0,,22.0,Nao,,Paciente nao foi internado,EVR,0.0,0.0,1.0,0.0,0.0,0.0,0.0,0.0,Doses mantidas,0.0,,0.0,Nao,0.0,,,,Nao,,Nao realizou radiografia de torax / Nao informado,Nao realizou Tomografia de torax / Nao informado,,,,,,,,,,,,,,,,,,,,,51.0,Masculino,2013-04-04,65.0,176.0,0.0,UTI geral,AVC (hemorragico ou isquemico),Nao,Não,Nao,Nao realizada,100.0,Nao,Nao,,89.0,25.0,,111.0,67.0,,,,,Nao,,,Nao,,,,,,,,,
2021-07-08,Sim,,Sim,Confirmado,HC UNICAMP - CMLM,01749-006,"SANTA BARBARA DO OESTE, SP",Sudeste,CMLM,Feminino,1974-11-22,46.0,0.0,Branco,58.0,159.0,22.94,Auto-imune,2012-12-17,8.0,HC - UNICAMP,Nao houve transplantes junto ou apos o figado,,Nao usava,Sem informacao,0.0,0.0,0.0,0.0,0.0,0.0,0.0,0.0,0.0,0.0,0.0,Tosse/ Mialgia,0.0,0.0,0.0,1.0,0.0,0.0,0.0,0.0,0.0,0.0,0.0,0.0,0.0,0.0,1.0,0.0,0.0,0.0,0.0,0.0,0.0,0.0,0.0,0.0,0.0,"Tosse, Mialgia",2021-06-01,2021-06-15,14.0,0.0,,2021-06-01,2.0,,107.0,107.0,PCR-Swab Nasal,Domiciliar,,0.0,,,0.0,1.0,,23.0,Paciente nao foi internado,,Paciente nao foi internado,TAC-MFS,0.0,0.0,0.0,0.0,0.0,1.0,1.0,0.0,Suspensao MMF,1.0,,0.0,Nao,0.0,,,,Nao,,Nao realizou radiografia de torax / Nao informado,Nao realizou Tomografia de torax / Nao informado,,,,,,,,,,,,,,,,,,,,,29.0,Feminino,2002-12-16,65.0,170.0,2.0,UTI geral,TCE,Sim,Não,,Nao realizada,100.0,Nao,Nao,,70.0,35.0,,113.0,17.0,,,,,Nao,,,,,,,,,,,,
2021-06-29,Sim,,Sim,Confirmado,HUS-10-EAG,726626,"Sorocaba, SP",Sul,EAG,Feminino,1955-10-11,65.0,1.0,Branco,,,,Hepatite C,2006-06-26,15.0,HUS - CETHUS,,"Diabetes Mellitus Tipo 1 ou Tipo 2, Obesidade",Sem dados,Nao,0.0,1.0,0.0,0.0,0.0,0.0,0.0,0.0,1.0,0.0,0.0,Febre/ Tosse,0.0,0.0,0.0,1.0,0.0,0.0,0.0,0.0,0.0,0.0,0.0,0.0,0.0,1.0,0.0,0.0,0.0,0.0,0.0,0.0,0.0,0.0,0.0,0.0,0.0,"Febre, Dispneia",2021-06-04,2021-06-05,1.0,0.0,1.0,2021-06-04,2.0,2021-06-05,104.0,104.0,PCR-Swab Nasal,Hospitalar / Internacao,"    1,00",15.0,10.0,,0.0,1.0,,24.0,Sim - com pronacao,2021-06-08,Sim,TAC-MFS,0.0,0.0,0.0,0.0,0.0,1.0,1.0,0.0,Suspensao MMF,1.0,Cortico-esteroides em altas doses,1.0,Sim,1.0,Nao,,Sem informacao,Nao,,Nao realizou radiografia de torax / Nao informado,Opacidades em vidro fosco,,12.0,54500.0,,30.0,29.0,,,,,,,,,,Sim,,Nao,Nao,,34.0,Masculino,2006-06-25,59.0,180.0,4.0,UTI geral,AVC (hemorragico ou isquemico),Sim,,,Nao realizada,100.0,Nao,Nao,,,,,,,,,,2021-06-28,Nao,,,Nao,,,Nao,Nao,16.0,14.0,,50.0,
2021-07-01,Sim,,Sim,Confirmado,SCSJC-FFS,266450-6,"Sao Jose dos Campos, SP",Sudeste,FFS,Feminino,1982-01-13,39.0,0.0,Pardo,85.0,170.0,29.41,Doenca Policistica,2020-09-29,0.0,Santa Casa de Sao Jose dos Campos,Nao houve transplantes junto ou apos o figado,,Nao usava,Nao,0.0,0.0,0.0,0.0,0.0,0.0,0.0,0.0,0.0,0.0,0.0,Tosse/ Dispneia/ Cefaleia,0.0,0.0,0.0,1.0,0.0,0.0,0.0,0.0,0.0,0.0,0.0,0.0,0.0,0.0,0.0,0.0,0.0,0.0,0.0,1.0,0.0,0.0,0.0,1.0,0.0,"Febre, Tosse, Coriza",2021-06-20,2021-06-06,-14.0,-14.0,,2021-06-06,2.0,,88.0,102.0,PCR-Swab Nasal,Domiciliar,,0.0,,,0.0,1.0,,25.0,Nao,,Nao,TAC-MFS,0.0,0.0,0.0,0.0,0.0,1.0,1.0,0.0,Suspensao MMF,1.0,"Cortico-esteroides em altas doses, Azatioprina",1.0,Sim,1.0,Nao,,Nao,Nao,,Nao realizou radiografia de torax / Nao informado,Tomografia normal,,,,,,,,,,,,,,,,Nao,,Nao,Nao,,30.0,Masculino,2020-09-27,71.0,179.0,1.0,UTI geral,Hemorragia Extradural,Sim,Não,Nao,Normal,,Sim,Sim,PCR,31.0,14.0,93.0,52.0,20.0,,,,,Nao,,,Nao,,,Nao,Nao,,,,,
2021-02-18,Sim,,Sim,Confirmado,SC - 7 - CMG,1237,"Belo Horizonte, MG",Sudeste,CMG,Feminino,1964-02-05,57.0,0.0,Branco,73.0,154.0,30.78,Criptogenica,2020-05-22,1.0,Santa Casa de Belo Horizonte,Nao houve transplantes junto ou apos o figado,Hipertensao,Nao usava,Nao,0.0,0.0,0.0,0.0,0.0,1.0,0.0,0.0,0.0,0.0,0.0,Coriza/ Diarreia/ hiporexia,0.0,0.0,0.0,0.0,0.0,0.0,0.0,0.0,0.0,0.0,0.0,0.0,0.0,0.0,0.0,0.0,1.0,0.0,0.0,0.0,0.0,1.0,1.0,0.0,0.0,"Coriza, Diarreia, hiporexia",2021-01-08,2021-01-21,13.0,20.0,,2021-01-28,2.0,,251.0,231.0,Sorologia,Domiciliar,,0.0,,,0.0,1.0,,28.0,Nao,,Paciente nao foi internado,TAC,0.0,0.0,0.0,0.0,0.0,1.0,0.0,0.0,Doses mantidas,0.0,,0.0,Nao,0.0,,,Sem informacao,Nao,,Nao realizou radiografia de torax / Nao informado,Nao realizou Tomografia de torax / Nao informado,,,,,,,,,,,,,,,,,,Nao,Nao,,60.0,Masculino,,,,,,,,,Nao,Nao realizada,,Nao,Nao,,,,,,,,,,,Nao,,,Nao,,,Nao,Nao,,,,,
2021-07-07,Sim,,Sim,Confirmado,HM-11-VCF,70176-3220,"CARIACICA, ES",Sudeste,VCF,Feminino,1960-03-01,61.0,1.0,Branco,70.0,165.0,25.71,Hepatite C,2013-02-28,8.0,HOSPITAL MERIDIONAL,Nao houve transplantes junto ou apos o figado,Diabetes Mellitus Tipo 1 ou Tipo 2,Nao usava,Nao,0.0,1.0,0.0,0.0,0.0,0.0,0.0,0.0,0.0,0.0,0.0,Diarreia,0.0,0.0,0.0,0.0,0.0,0.0,0.0,0.0,0.0,0.0,0.0,0.0,0.0,0.0,0.0,0.0,0.0,0.0,0.0,0.0,0.0,0.0,1.0,0.0,0.0,Dispneia,2021-03-20,2021-03-25,5.0,13.0,-8.0,2021-04-02,2.0,2021-03-25,37.0,24.0,PCR-Swab Nasal,Hospitalar / Internacao,"    1,00",21.0,20.0,0.0,0.0,2.0,2021-04-26,32.0,Sim - sem pronacao,2021-04-06,Sim,TAC-MFS,0.0,0.0,0.0,0.0,0.0,1.0,1.0,0.0,Suspensao total,1.0,,0.0,Nao,0.0,,,,,,Radiografia normal,Opacidades em vidro fosco,,,,,,,,,,,,,,,,Sim,,Nao,Nao,,25.0,Masculino,2013-02-27,70.0,170.0,3.0,UTI geral,TCE,Sim,Não,,Nao realizada,99.0,Nao,Nao,,294.0,190.0,,77.0,22.0,,,,,Nao,,,,,,,,,,,,
2021-05-30,Sim,,Sim,Confirmado,HMSJ-04-MZH,133015-4220,"Joinville, SC",Sul,MZH,Feminino,1954-12-08,66.0,1.0,Branco,75.0,177.0,23.94,Hepatite C,2015-08-28,5.0,Hospital Municipal Sao Jose/ Equipe Dr Christian,Nao houve transplantes junto ou apos o figado,Hipertensao,"Inibidores da ECA (Captopril, enalapril, ramipril)",Sim - previo,0.0,0.0,0.0,0.0,0.0,1.0,0.0,0.0,0.0,0.0,0.0,Febre/ Dispneia/ Dor toracica/ Coriza/ Mialgia,0.0,0.0,0.0,0.0,0.0,0.0,0.0,0.0,0.0,0.0,0.0,0.0,0.0,1.0,1.0,0.0,0.0,0.0,0.0,0.0,0.0,1.0,0.0,1.0,1.0,"Febre, Dispneia, Dor toracica, Mialgia",2021-02-10,2021-02-11,1.0,1.0,1.0,2021-02-11,2.0,2021-02-12,34.0,33.0,PCR-Swab Nasal,Hospitalar / Internacao,"    1,00",45.0,45.0,3.0,45.0,2.0,2021-03-16,33.0,Sim - com pronacao,2021-02-14,Sim,TAC-MFS,0.0,0.0,0.0,0.0,0.0,1.0,1.0,0.0,"Reducao de inibidores de Calcineurina (TAC, CsA)",1.0,"Cortico-esteroides em altas doses, Heparina",1.0,Sim,1.0,,,,,,Consolidacoes bilaterais,Opacidades em vidro fosco,,,90000.0,,110.0,130.0,,,,,,,,,,Sem infromacoes,,Nao,Nao,,34.0,Masculino,2015-08-27,70.0,175.0,1.0,UTI geral,TCE,Nao,Não,Nao,Nao realizada,,Nao,Nao,,49.0,34.0,,5.0,24.0,,1.0,,,,,,,,,,,,,,,
2021-04-30,Sim,,Sim,Confirmado,HUWC-32-KCSS,0,"Crateus, CE",Nordeste,KLSS,Feminino,1992-07-24,29.0,0.0,Pardo,60.0,155.0,24.97,Hepatite fulminante,2007-01-22,14.0,HUWC/UFC,Nao houve transplantes junto ou apos o figado,,Nao usava,Nao,0.0,0.0,0.0,0.0,0.0,0.0,0.0,0.0,0.0,0.0,0.0,Dor de garganta,0.0,1.0,0.0,0.0,0.0,0.0,0.0,0.0,0.0,0.0,0.0,0.0,0.0,0.0,0.0,0.0,0.0,0.0,0.0,0.0,0.0,0.0,0.0,0.0,0.0,"Alteracao do olfato, Alteracao do paladar, Dor de garganta",2021-03-24,2021-03-25,1.0,1.0,,2021-03-25,2.0,,176.0,175.0,PCR-Swab Nasal,Domiciliar,,0.0,,1.0,5.0,1.0,,36.0,Paciente nao foi internado,,Paciente nao foi internado,TAC-MFS,0.0,0.0,0.0,0.0,0.0,1.0,1.0,0.0,Doses mantidas,0.0,Azitromicina,1.0,Sim,1.0,,,,,,Nao realizou radiografia de torax / Nao informado,Nao realizou Tomografia de torax / Nao informado,,,,,,,,,,,,,,,,Nao,,Nao,Nao,,,,,,,,,,,,,Nao realizada,,Nao,Nao,,,,,,,,,,2021-04-07,Nao,,,Nao,,,,,,,,,